Limesdr-usb usb error .. reading lsm

#1

KC7NOA-Ibase@linux-7kco:~> Lime
LimeQuickTest LimeSuiteGUI LimeUtil
KC7NOA-Ibase@linux-7kco:~> LimeQuickTest
[ TESTING STARTED ]
->Start time: Tue Mar 5 19:40:16 2019

Gateware version mismatch!
Expected gateware version 2, revision 18
But found version 2, revision 20
Follow the FW and FPGA upgrade instructions:
http://wiki.myriadrf.org/Lime_Suite#Flashing_images
Or run update on the command line: LimeUtil --update

->Device: LimeSDR-USB, media=USB 3.0, module=FX3, addr=1d50:6108, serial=0009060B00473825
Serial Number: 0009060B00473825

[ Clock Network Test ]
->FX3 GPIF clock test
Test results: 18619; 22375; 26131 - PASSED
->Si5351C test
CLK0: 17553 / 17554 - PASSED
CLK1: 17553 / 17554 - PASSED
CLK2: 17553 / 17554 - PASSED
CLK3: 17553 / 17554 - PASSED
CLK4: 17553 / 17554 - PASSED
CLK5: 17553 / 17554 - PASSED
CLK6: 17553 / 17554 - PASSED
->ADF4002 Test
Result: 10 - PASSED
->VCTCXO test
Results : 5112955 (min); 5113090 (max) - PASSED
->Clock Network Test PASSED

[ FPGA EEPROM Test ]
->Read EEPROM
->Read data: 11 01 13 11 01 13 02
->FPGA EEPROM Test PASSED

[ LMS7002M Test ]
->Perform Registers Test
->External Reset line test
Reg 0x20: Write value 0xFFFD, Read value 0xFFFD
Reg 0x20: value after reset 0x0FFFF
->LMS7002M Test PASSED

[ RF Loopback Test ]
->Configure LMS
->Run Tests (TX_2-> LNA_L):
Read(64 bytes) failed
CH0 (SXR=800.0MHz, SXT=805.0MHz): Result:(-12.9 dBFS, 5.00 MHz) - PASSED
Read(64 bytes) failed
Write(64 bytes) failed
Write(64 bytes) failed
Write(64 bytes) failed
Write(64 bytes) failed
Write(64 bytes) failed
Write(64 bytes) failed
Write(64 bytes) failed
Write(64 bytes) failed
Write(64 bytes) failed
Write(64 bytes) failed
Write(64 bytes) failed
Write(64 bytes) failed
Write(64 bytes) failed
Write(64 bytes) failed
Write(64 bytes) failed
Write(64 bytes) failed
Write(64 bytes) failed
Write(64 bytes) failed
Write(64 bytes) failed
Write(64 bytes) failed
Write(64 bytes) failed
Write(64 bytes) failed
Write(64 bytes) failed
Write(64 bytes) failed
Write(64 bytes) failed
Write(64 bytes) failed
Write(64 bytes) failed
Write(64 bytes) failed
Write(64 bytes) failed
Write(64 bytes) failed
Write(64 bytes) failed
Write(64 bytes) failed
Write(64 bytes) failed
Write(64 bytes) failed
Write(64 bytes) failed
Write(64 bytes) failed
Write(64 bytes) failed
Write(64 bytes) failed
Write(64 bytes) failed
Write(64 bytes) failed
Write(64 bytes) failed
Write(64 bytes) failed
Write(64 bytes) failed
Failed to read samples: Timeout
CH1 (SXR=800.0MHz, SXT=805.0MHz): Result:(-15.0 dBFS, 5.00 MHz) - FAILED
->Run Tests (TX_1 -> LNA_W):
Write(64 bytes) failed
->Run Tests (TX_2-> LNA_H):
Write(64 bytes) failed
->RF Loopback Test FAILED

=> Board tests FAILED <=

Elapsed time: 7.24 seconds

KC7NOA-Ibase@linux-7kco:~> LimeQuickTest
[ TESTING STARTED ]
->Start time: Tue Mar 5 19:40:35 2019

Gateware version mismatch!
Expected gateware version 2, revision 18
But found version 2, revision 20
Follow the FW and FPGA upgrade instructions:
http://wiki.myriadrf.org/Lime_Suite#Flashing_images
Or run update on the command line: LimeUtil --update

->Device: LimeSDR-USB, media=USB 3.0, module=FX3, addr=1d50:6108, serial=0009060B00473825
Serial Number: 0009060B00473825

[ Clock Network Test ]
->FX3 GPIF clock test
Test results: 19922; 23678; 27434 - PASSED
->Si5351C test
CLK0: 17554 / 17554 - PASSED
CLK1: 17554 / 17554 - PASSED
CLK2: 17554 / 17554 - PASSED
CLK3: 17554 / 17554 - PASSED
CLK4: 17554 / 17554 - PASSED
CLK5: 17554 / 17554 - PASSED
CLK6: 17554 / 17554 - PASSED
->ADF4002 Test
Result: 10 - PASSED
->VCTCXO test
Results : 5112956 (min); 5113091 (max) - PASSED
->Clock Network Test PASSED

[ FPGA EEPROM Test ]
->Read EEPROM
->Read data: 11 01 13 11 01 13 02
->FPGA EEPROM Test PASSED

[ LMS7002M Test ]
->Perform Registers Test
->External Reset line test
Reg 0x20: Write value 0xFFFD, Read value 0xFFFD
Reg 0x20: value after reset 0x0FFFF
->LMS7002M Test PASSED

[ RF Loopback Test ]
->Configure LMS
->Run Tests (TX_2-> LNA_L):
Read(64 bytes) failed
CH0 (SXR=800.0MHz, SXT=805.0MHz): Result:(-13.0 dBFS, 5.00 MHz) - PASSED
Read(64 bytes) failed
Write(64 bytes) failed
Write(64 bytes) failed
Write(64 bytes) failed
Write(64 bytes) failed
Write(64 bytes) failed
Write(64 bytes) failed
Write(64 bytes) failed
Write(64 bytes) failed
Write(64 bytes) failed
Write(64 bytes) failed
Write(64 bytes) failed
Write(64 bytes) failed
Write(64 bytes) failed
Write(64 bytes) failed
Write(64 bytes) failed
Write(64 bytes) failed
Write(64 bytes) failed
Write(64 bytes) failed
Write(64 bytes) failed
Write(64 bytes) failed
Write(64 bytes) failed
Write(64 bytes) failed
Write(64 bytes) failed
Write(64 bytes) failed
Write(64 bytes) failed
Write(64 bytes) failed
Write(64 bytes) failed
Write(64 bytes) failed
Write(64 bytes) failed
Write(64 bytes) failed
Write(64 bytes) failed
Write(64 bytes) failed
Write(64 bytes) failed
Write(64 bytes) failed
Write(64 bytes) failed
Write(64 bytes) failed
Write(64 bytes) failed
Write(64 bytes) failed
Write(64 bytes) failed
Write(64 bytes) failed
Write(64 bytes) failed
Write(64 bytes) failed
Write(64 bytes) failed
Failed to read samples: Timeout
CH1 (SXR=800.0MHz, SXT=805.0MHz): Result:(-15.0 dBFS, 5.00 MHz) - FAILED
->Run Tests (TX_1 -> LNA_W):
Write(64 bytes) failed
->Run Tests (TX_2-> LNA_H):
Write(64 bytes) failed
->RF Loopback Test FAILED

=> Board tests FAILED <=

Elapsed time: 7.16 seconds

KC7NOA-Ibase@linux-7kco:~> LimeQuickTest
[ TESTING STARTED ]
->Start time: Tue Mar 5 19:41:14 2019

Gateware version mismatch!
Expected gateware version 2, revision 18
But found version 2, revision 20
Follow the FW and FPGA upgrade instructions:
http://wiki.myriadrf.org/Lime_Suite#Flashing_images
Or run update on the command line: LimeUtil --update

->Device: LimeSDR-USB, media=USB 3.0, module=FX3, addr=1d50:6108, serial=0009060B00473825
Serial Number: 0009060B00473825

[ Clock Network Test ]
->FX3 GPIF clock test
Test results: 19026; 22782; 26538 - PASSED
->Si5351C test
CLK0: 17554 / 17554 - PASSED
CLK1: 17554 / 17554 - PASSED
CLK2: 17554 / 17554 - PASSED
CLK3: 17554 / 17554 - PASSED
CLK4: 17554 / 17554 - PASSED
CLK5: 17554 / 17554 - PASSED
CLK6: 17554 / 17554 - PASSED
->ADF4002 Test
Result: 10 - PASSED
->VCTCXO test
Results : 5112956 (min); 5113091 (max) - PASSED
->Clock Network Test PASSED

[ FPGA EEPROM Test ]
->Read EEPROM
->Read data: 11 01 13 11 01 13 02
->FPGA EEPROM Test PASSED

[ LMS7002M Test ]
->Perform Registers Test
->External Reset line test
Reg 0x20: Write value 0xFFFD, Read value 0xFFFD
Reg 0x20: value after reset 0x0FFFF
->LMS7002M Test PASSED

[ RF Loopback Test ]
->Configure LMS
->Run Tests (TX_2-> LNA_L):
CH0 (SXR=800.0MHz, SXT=805.0MHz): Result:(-13.1 dBFS, 5.00 MHz) - PASSED
CH1 (SXR=800.0MHz, SXT=805.0MHz): Result:(-15.3 dBFS, 5.00 MHz) - PASSED
->Run Tests (TX_1 -> LNA_W):
CH0 (SXR=1800.0MHz, SXT=1805.0MHz): Result:(-13.1 dBFS, 5.00 MHz) - PASSED
CH1 (SXR=1800.0MHz, SXT=1805.0MHz): Result:(-18.8 dBFS, 5.00 MHz) - PASSED
->Run Tests (TX_2-> LNA_H):
CH0 (SXR=2500.0MHz, SXT=2505.0MHz): Result:(-18.1 dBFS, 5.00 MHz) - PASSED
CH1 (SXR=2500.0MHz, SXT=2505.0MHz): Result:(-11.8 dBFS, 5.00 MHz) - PASSED
->RF Loopback Test PASSED

=> Board tests PASSED <=

Elapsed time: 1.59 seconds

KC7NOA-Ibase@linux-7kco:~>

after 4 plug, unplug cycles its working again … does this offten

#2

repair or firmware related?

https://pastebin.com/g39cPdT2

#3

Your LimeSuite is too old.

#4

version 18.10.0-release too old?