USB LimeSDR w/aluminum kit not working on AamriLTE 100 2018-10-18


#1
[TRX] Ubuntu 16 found

trx_lms7002m.cpp: In function ‘void trx_lms7002m_end(TRXState*)’:
trx_lms7002m.cpp:67:5: error: ‘LMS7_Device’ is not a member of ‘lime’
lime::LMS7_Device* lms = (lime::LMS7_Device*)s->device;
^
trx_lms7002m.cpp:67:5: note: suggested alternative:
In file included from trx_lms7002m.cpp:17:0:
/usr/include/lime/lms7_device.h:18:16: note: ‘LMS7_Device’
class LIME_API LMS7_Device
^
trx_lms7002m.cpp:67:24: error: ‘lms’ was not declared in this scope
lime::LMS7_Device* lms = (lime::LMS7_Device*)s->device;
^
trx_lms7002m.cpp:67:31: error: ‘LMS7_Device’ is not a member of ‘lime’
lime::LMS7_Device* lms = (lime::LMS7_Device*)s->device;
^
trx_lms7002m.cpp:67:31: note: suggested alternative:
In file included from trx_lms7002m.cpp:17:0:
/usr/include/lime/lms7_device.h:18:16: note: ‘LMS7_Device’
class LIME_API LMS7_Device
^
trx_lms7002m.cpp:67:49: error: expected primary-expression before ‘)’ token
lime::LMS7_Device* lms = (lime::LMS7_Device*)s->device;
^
trx_lms7002m.cpp: In function ‘int trx_lms7002m_start(TRXState*, const TRXDriverParams*)’:
trx_lms7002m.cpp:405:2: error: ‘LMS7_Device’ is not a member of ‘lime’
lime::LMS7_Device* dev = (lime::LMS7_Device*)s->device;
^
trx_lms7002m.cpp:405:2: note: suggested alternative:
In file included from trx_lms7002m.cpp:17:0:
/usr/include/lime/lms7_device.h:18:16: note: ‘LMS7_Device’
class LIME_API LMS7_Device
^
trx_lms7002m.cpp:405:21: error: ‘dev’ was not declared in this scope
lime::LMS7_Device* dev = (lime::LMS7_Device*)s->device;
^
trx_lms7002m.cpp:405:28: error: ‘LMS7_Device’ is not a member of ‘lime’
lime::LMS7_Device* dev = (lime::LMS7_Device*)s->device;
^
trx_lms7002m.cpp:405:28: note: suggested alternative:
In file included from trx_lms7002m.cpp:17:0:
/usr/include/lime/lms7_device.h:18:16: note: ‘LMS7_Device’
class LIME_API LMS7_Device
^
trx_lms7002m.cpp:405:46: error: expected primary-expression before ‘)’ token
lime::LMS7_Device* dev = (lime::LMS7_Device*)s->device;
^
make: *** [trx_lms7002m.so] Error 1
[TRX] Makefile:34: recipe for target ‘trx_lms7002m.so’ failed
[TRX] Error while compiling trx driver
Installation failed


#2

Amarisoft LTE? Have you tried contacting them for support?


#3

Hi @PDVuser,

Is LimeSuite installed and compiled? Do you use this plugin?