# LimeSuiteNG will not build on Ubuntu 22.04

**URL:** <https://discourse.myriadrf.org/t/limesuiteng-will-not-build-on-ubuntu-22-04/8652>\
**Category:** LimeSDR\
**Created:** [15 February 2025 18:40 UTC](https://discourse.myriadrf.org/t/limesuiteng-will-not-build-on-ubuntu-22-04/8652 "2025-02-15T18:40:50Z")\
**Posts on this page:** 3\
**Page:** 1

<div class="post-metadata">

**Author:** ![RightHalfPlane](https://avatars.discourse-cdn.com/v4/letter/r/46a35a/32.png) [@RightHalfPlane](https://discourse.myriadrf.org/u/RightHalfPlane)\
**Post date:** [15 February 2025 18:40 UTC](https://discourse.myriadrf.org/t/limesuiteng-will-not-build-on-ubuntu-22-04/8652/1 "2025-02-15T18:40:50Z")

</div>

I tied to build on Ubuntu 22.04 using -

git clone [GitHub - myriadrf/LimeSuiteNG](https://github.com/myriadrf/LimeSuiteNG)  
cd LimeSuiteNG  
sudo ./install\_dependencies.sh  
cmake -B build && cd build  
make  
sudo make install  
sudo ldconfig

Here is the console output -

ir@dir-Z390-UD:~$ tcsh  
dir-Z390-UD:~\> cd ‘/home/dir/Documents/Archive/sendUSB.cpp’  
/home/dir/Documents/Archive/sendUSB.cpp: Not a directory.  
dir-Z390-UD:~\> cd ‘/home/dir/Documents/Archive’  
dir-Z390-UD:~/Documents/Archive\> git clone [GitHub - myriadrf/LimeSuiteNG](https://github.com/myriadrf/LimeSuiteNG)  
Cloning into ‘LimeSuiteNG’…  
remote: Enumerating objects: 24881, done.  
remote: Counting objects: 100% (3306/3306), done.  
remote: Compressing objects: 100% (495/495), done.  
remote: Total 24881 (delta 2989), reused 2839 (delta 2808), pack-reused 21575 (from 2)  
Receiving objects: 100% (24881/24881), 15.22 MiB | 2.93 MiB/s, done.  
Resolving deltas: 100% (18459/18459), done.  
dir-Z390-UD:~/Documents/Archive\> cd LimeSuiteNG  
dir-Z390-UD:~/Documents/Archive/LimeSuiteNG\> sudo ./install\_dependencies.sh  
[sudo] password for dir:  
Reading package lists… Done  
Building dependency tree… Done  
Reading state information… Done  
build-essential is already the newest version (12.9ubuntu3).  
libglew-dev is already the newest version (2.2.0-4).  
libsoapysdr-dev is already the newest version (0.8.1-2build1).  
libwxbase3.0-dev is already the newest version (3.0.5.1+dfsg-4).  
libwxgtk3.0-gtk3-dev is already the newest version (3.0.5.1+dfsg-4).  
cmake is already the newest version (3.22.1-1ubuntu1.22.04.2).  
libusb-1.0-0-dev is already the newest version (2:1.0.25-1ubuntu2).  
linux-headers-generic-hwe-22.04 is already the newest version (6.8.0-52.53~22.04.1).  
linux-headers-generic-hwe-22.04 set to manually installed.  
The following packages were automatically installed and are no longer required:  
libwpe-1.0-1 libwpebackend-fdo-1.0-1  
Use ‘sudo apt autoremove’ to remove them.  
0 upgraded, 0 newly installed, 0 to remove and 176 not upgraded.  
dir-Z390-UD:~/Documents/Archive/LimeSuiteNG\> cmake -B build && cd build  
cmake: /usr/local/lib/libcurl.so.4: no version information available (required by cmake)  
– The C compiler identification is GNU 11.4.0  
– The CXX compiler identification is GNU 11.4.0  
– Detecting C compiler ABI info  
– Detecting C compiler ABI info - done  
– Check for working C compiler: /usr/bin/cc - skipped  
– Detecting C compile features  
– Detecting C compile features - done  
– Detecting CXX compiler ABI info  
– Detecting CXX compiler ABI info - done  
– Check for working CXX compiler: /usr/bin/c++ - skipped  
– Detecting CXX compile features  
– Detecting CXX compile features - done  
– cmake version: 3.22.1  
– ##### #####  
– Populating kissfft  
/usr/bin/cmake: /usr/local/lib/libcurl.so.4: no version information available (required by /usr/bin/cmake)  
– Configuring done  
– Generating done  
– Build files have been written to: /home/dir/Documents/Archive/LimeSuiteNG/build/external/kissfft-subbuild  
/usr/bin/cmake: /usr/local/lib/libcurl.so.4: no version information available (required by /usr/bin/cmake)  
/usr/bin/cmake: /usr/local/lib/libcurl.so.4: no version information available (required by /usr/bin/cmake)  
/usr/bin/cmake: /usr/local/lib/libcurl.so.4: no version information available (required by /usr/bin/cmake)  
/usr/bin/cmake: /usr/local/lib/libcurl.so.4: no version information available (required by /usr/bin/cmake)  
/usr/bin/cmake: /usr/local/lib/libcurl.so.4: no version information available (required by /usr/bin/cmake)  
[11%] Creating directories for ‘kissfft-populate’  
/usr/bin/cmake: /usr/local/lib/libcurl.so.4: no version information available (required by /usr/bin/cmake)  
/usr/bin/cmake: /usr/local/lib/libcurl.so.4: no version information available (required by /usr/bin/cmake)  
/usr/bin/cmake: /usr/local/lib/libcurl.so.4: no version information available (required by /usr/bin/cmake)  
/usr/bin/cmake: /usr/local/lib/libcurl.so.4: no version information available (required by /usr/bin/cmake)  
/usr/bin/cmake: /usr/local/lib/libcurl.so.4: no version information available (required by /usr/bin/cmake)  
/usr/bin/cmake: /usr/local/lib/libcurl.so.4: no version information available (required by /usr/bin/cmake)  
/usr/bin/cmake: /usr/local/lib/libcurl.so.4: no version information available (required by /usr/bin/cmake)  
/usr/bin/cmake: /usr/local/lib/libcurl.so.4: no version information available (required by /usr/bin/cmake)  
/usr/bin/cmake: /usr/local/lib/libcurl.so.4: no version information available (required by /usr/bin/cmake)  
[22%] No download step for ‘kissfft-populate’  
/usr/bin/cmake: /usr/local/lib/libcurl.so.4: no version information available (required by /usr/bin/cmake)  
/usr/bin/cmake: /usr/local/lib/libcurl.so.4: no version information available (required by /usr/bin/cmake)  
/usr/bin/cmake: /usr/local/lib/libcurl.so.4: no version information available (required by /usr/bin/cmake)  
[33%] No update step for ‘kissfft-populate’  
/usr/bin/cmake: /usr/local/lib/libcurl.so.4: no version information available (required by /usr/bin/cmake)  
/usr/bin/cmake: /usr/local/lib/libcurl.so.4: no version information available (required by /usr/bin/cmake)  
/usr/bin/cmake: /usr/local/lib/libcurl.so.4: no version information available (required by /usr/bin/cmake)  
[44%] No patch step for ‘kissfft-populate’  
/usr/bin/cmake: /usr/local/lib/libcurl.so.4: no version information available (required by /usr/bin/cmake)  
/usr/bin/cmake: /usr/local/lib/libcurl.so.4: no version information available (required by /usr/bin/cmake)  
/usr/bin/cmake: /usr/local/lib/libcurl.so.4: no version information available (required by /usr/bin/cmake)  
[55%] No configure step for ‘kissfft-populate’  
/usr/bin/cmake: /usr/local/lib/libcurl.so.4: no version information available (required by /usr/bin/cmake)  
/usr/bin/cmake: /usr/local/lib/libcurl.so.4: no version information available (required by /usr/bin/cmake)  
/usr/bin/cmake: /usr/local/lib/libcurl.so.4: no version information available (required by /usr/bin/cmake)  
[66%] No build step for ‘kissfft-populate’  
/usr/bin/cmake: /usr/local/lib/libcurl.so.4: no version information available (required by /usr/bin/cmake)  
/usr/bin/cmake: /usr/local/lib/libcurl.so.4: no version information available (required by /usr/bin/cmake)  
/usr/bin/cmake: /usr/local/lib/libcurl.so.4: no version information available (required by /usr/bin/cmake)  
[77%] No install step for ‘kissfft-populate’  
/usr/bin/cmake: /usr/local/lib/libcurl.so.4: no version information available (required by /usr/bin/cmake)  
/usr/bin/cmake: /usr/local/lib/libcurl.so.4: no version information available (required by /usr/bin/cmake)  
/usr/bin/cmake: /usr/local/lib/libcurl.so.4: no version information available (required by /usr/bin/cmake)  
[88%] No test step for ‘kissfft-populate’  
/usr/bin/cmake: /usr/local/lib/libcurl.so.4: no version information available (required by /usr/bin/cmake)  
/usr/bin/cmake: /usr/local/lib/libcurl.so.4: no version information available (required by /usr/bin/cmake)  
/usr/bin/cmake: /usr/local/lib/libcurl.so.4: no version information available (required by /usr/bin/cmake)  
[100%] Completed ‘kissfft-populate’  
/usr/bin/cmake: /usr/local/lib/libcurl.so.4: no version information available (required by /usr/bin/cmake)  
/usr/bin/cmake: /usr/local/lib/libcurl.so.4: no version information available (required by /usr/bin/cmake)  
/usr/bin/cmake: /usr/local/lib/libcurl.so.4: no version information available (required by /usr/bin/cmake)  
/usr/bin/cmake: /usr/local/lib/libcurl.so.4: no version information available (required by /usr/bin/cmake)  
[100%] Built target kissfft-populate  
/usr/bin/cmake: /usr/local/lib/libcurl.so.4: no version information available (required by /usr/bin/cmake)  
– Building KissFFT with datatype: float  
– Building static library  
– PKGINCLUDEDIR is include/kissfft  
– Populating args  
/usr/bin/cmake: /usr/local/lib/libcurl.so.4: no version information available (required by /usr/bin/cmake)  
– Configuring done  
– Generating done  
– Build files have been written to: /home/dir/Documents/Archive/LimeSuiteNG/build/external/args-subbuild  
/usr/bin/cmake: /usr/local/lib/libcurl.so.4: no version information available (required by /usr/bin/cmake)  
/usr/bin/cmake: /usr/local/lib/libcurl.so.4: no version information available (required by /usr/bin/cmake)  
/usr/bin/cmake: /usr/local/lib/libcurl.so.4: no version information available (required by /usr/bin/cmake)  
/usr/bin/cmake: /usr/local/lib/libcurl.so.4: no version information available (required by /usr/bin/cmake)  
/usr/bin/cmake: /usr/local/lib/libcurl.so.4: no version information available (required by /usr/bin/cmake)  
[11%] Creating directories for ‘args-populate’  
/usr/bin/cmake: /usr/local/lib/libcurl.so.4: no version information available (required by /usr/bin/cmake)  
/usr/bin/cmake: /usr/local/lib/libcurl.so.4: no version information available (required by /usr/bin/cmake)  
/usr/bin/cmake: /usr/local/lib/libcurl.so.4: no version information available (required by /usr/bin/cmake)  
/usr/bin/cmake: /usr/local/lib/libcurl.so.4: no version information available (required by /usr/bin/cmake)  
/usr/bin/cmake: /usr/local/lib/libcurl.so.4: no version information available (required by /usr/bin/cmake)  
/usr/bin/cmake: /usr/local/lib/libcurl.so.4: no version information available (required by /usr/bin/cmake)  
/usr/bin/cmake: /usr/local/lib/libcurl.so.4: no version information available (required by /usr/bin/cmake)  
/usr/bin/cmake: /usr/local/lib/libcurl.so.4: no version information available (required by /usr/bin/cmake)  
/usr/bin/cmake: /usr/local/lib/libcurl.so.4: no version information available (required by /usr/bin/cmake)  
[22%] No download step for ‘args-populate’  
/usr/bin/cmake: /usr/local/lib/libcurl.so.4: no version information available (required by /usr/bin/cmake)  
/usr/bin/cmake: /usr/local/lib/libcurl.so.4: no version information available (required by /usr/bin/cmake)  
/usr/bin/cmake: /usr/local/lib/libcurl.so.4: no version information available (required by /usr/bin/cmake)  
[33%] No update step for ‘args-populate’  
/usr/bin/cmake: /usr/local/lib/libcurl.so.4: no version information available (required by /usr/bin/cmake)  
/usr/bin/cmake: /usr/local/lib/libcurl.so.4: no version information available (required by /usr/bin/cmake)  
/usr/bin/cmake: /usr/local/lib/libcurl.so.4: no version information available (required by /usr/bin/cmake)  
[44%] No patch step for ‘args-populate’  
/usr/bin/cmake: /usr/local/lib/libcurl.so.4: no version information available (required by /usr/bin/cmake)  
/usr/bin/cmake: /usr/local/lib/libcurl.so.4: no version information available (required by /usr/bin/cmake)  
/usr/bin/cmake: /usr/local/lib/libcurl.so.4: no version information available (required by /usr/bin/cmake)  
[55%] No configure step for ‘args-populate’  
/usr/bin/cmake: /usr/local/lib/libcurl.so.4: no version information available (required by /usr/bin/cmake)  
/usr/bin/cmake: /usr/local/lib/libcurl.so.4: no version information available (required by /usr/bin/cmake)  
/usr/bin/cmake: /usr/local/lib/libcurl.so.4: no version information available (required by /usr/bin/cmake)  
[66%] No build step for ‘args-populate’  
/usr/bin/cmake: /usr/local/lib/libcurl.so.4: no version information available (required by /usr/bin/cmake)  
/usr/bin/cmake: /usr/local/lib/libcurl.so.4: no version information available (required by /usr/bin/cmake)  
/usr/bin/cmake: /usr/local/lib/libcurl.so.4: no version information available (required by /usr/bin/cmake)  
[77%] No install step for ‘args-populate’  
/usr/bin/cmake: /usr/local/lib/libcurl.so.4: no version information available (required by /usr/bin/cmake)  
/usr/bin/cmake: /usr/local/lib/libcurl.so.4: no version information available (required by /usr/bin/cmake)  
/usr/bin/cmake: /usr/local/lib/libcurl.so.4: no version information available (required by /usr/bin/cmake)  
[88%] No test step for ‘args-populate’  
/usr/bin/cmake: /usr/local/lib/libcurl.so.4: no version information available (required by /usr/bin/cmake)  
/usr/bin/cmake: /usr/local/lib/libcurl.so.4: no version information available (required by /usr/bin/cmake)  
/usr/bin/cmake: /usr/local/lib/libcurl.so.4: no version information available (required by /usr/bin/cmake)  
[100%] Completed ‘args-populate’  
/usr/bin/cmake: /usr/local/lib/libcurl.so.4: no version information available (required by /usr/bin/cmake)  
/usr/bin/cmake: /usr/local/lib/libcurl.so.4: no version information available (required by /usr/bin/cmake)  
/usr/bin/cmake: /usr/local/lib/libcurl.so.4: no version information available (required by /usr/bin/cmake)  
/usr/bin/cmake: /usr/local/lib/libcurl.so.4: no version information available (required by /usr/bin/cmake)  
[100%] Built target args-populate  
/usr/bin/cmake: /usr/local/lib/libcurl.so.4: no version information available (required by /usr/bin/cmake)  
– Populating cpp-feather-ini-parser  
/usr/bin/cmake: /usr/local/lib/libcurl.so.4: no version information available (required by /usr/bin/cmake)  
– Configuring done  
– Generating done  
– Build files have been written to: /home/dir/Documents/Archive/LimeSuiteNG/build/external/cpp-feather-ini-parser-subbuild  
/usr/bin/cmake: /usr/local/lib/libcurl.so.4: no version information available (required by /usr/bin/cmake)  
/usr/bin/cmake: /usr/local/lib/libcurl.so.4: no version information available (required by /usr/bin/cmake)  
/usr/bin/cmake: /usr/local/lib/libcurl.so.4: no version information available (required by /usr/bin/cmake)  
/usr/bin/cmake: /usr/local/lib/libcurl.so.4: no version information available (required by /usr/bin/cmake)  
/usr/bin/cmake: /usr/local/lib/libcurl.so.4: no version information available (required by /usr/bin/cmake)  
[11%] Creating directories for ‘cpp-feather-ini-parser-populate’  
/usr/bin/cmake: /usr/local/lib/libcurl.so.4: no version information available (required by /usr/bin/cmake)  
/usr/bin/cmake: /usr/local/lib/libcurl.so.4: no version information available (required by /usr/bin/cmake)  
/usr/bin/cmake: /usr/local/lib/libcurl.so.4: no version information available (required by /usr/bin/cmake)  
/usr/bin/cmake: /usr/local/lib/libcurl.so.4: no version information available (required by /usr/bin/cmake)  
/usr/bin/cmake: /usr/local/lib/libcurl.so.4: no version information available (required by /usr/bin/cmake)  
/usr/bin/cmake: /usr/local/lib/libcurl.so.4: no version information available (required by /usr/bin/cmake)  
/usr/bin/cmake: /usr/local/lib/libcurl.so.4: no version information available (required by /usr/bin/cmake)  
/usr/bin/cmake: /usr/local/lib/libcurl.so.4: no version information available (required by /usr/bin/cmake)  
/usr/bin/cmake: /usr/local/lib/libcurl.so.4: no version information available (required by /usr/bin/cmake)  
[22%] No download step for ‘cpp-feather-ini-parser-populate’  
/usr/bin/cmake: /usr/local/lib/libcurl.so.4: no version information available (required by /usr/bin/cmake)  
/usr/bin/cmake: /usr/local/lib/libcurl.so.4: no version information available (required by /usr/bin/cmake)  
/usr/bin/cmake: /usr/local/lib/libcurl.so.4: no version information available (required by /usr/bin/cmake)  
[33%] No update step for ‘cpp-feather-ini-parser-populate’  
/usr/bin/cmake: /usr/local/lib/libcurl.so.4: no version information available (required by /usr/bin/cmake)  
/usr/bin/cmake: /usr/local/lib/libcurl.so.4: no version information available (required by /usr/bin/cmake)  
/usr/bin/cmake: /usr/local/lib/libcurl.so.4: no version information available (required by /usr/bin/cmake)  
[44%] No patch step for ‘cpp-feather-ini-parser-populate’  
/usr/bin/cmake: /usr/local/lib/libcurl.so.4: no version information available (required by /usr/bin/cmake)  
/usr/bin/cmake: /usr/local/lib/libcurl.so.4: no version information available (required by /usr/bin/cmake)  
/usr/bin/cmake: /usr/local/lib/libcurl.so.4: no version information available (required by /usr/bin/cmake)  
[55%] No configure step for ‘cpp-feather-ini-parser-populate’  
/usr/bin/cmake: /usr/local/lib/libcurl.so.4: no version information available (required by /usr/bin/cmake)  
/usr/bin/cmake: /usr/local/lib/libcurl.so.4: no version information available (required by /usr/bin/cmake)  
/usr/bin/cmake: /usr/local/lib/libcurl.so.4: no version information available (required by /usr/bin/cmake)  
[66%] No build step for ‘cpp-feather-ini-parser-populate’  
/usr/bin/cmake: /usr/local/lib/libcurl.so.4: no version information available (required by /usr/bin/cmake)  
/usr/bin/cmake: /usr/local/lib/libcurl.so.4: no version information available (required by /usr/bin/cmake)  
/usr/bin/cmake: /usr/local/lib/libcurl.so.4: no version information available (required by /usr/bin/cmake)  
[77%] No install step for ‘cpp-feather-ini-parser-populate’  
/usr/bin/cmake: /usr/local/lib/libcurl.so.4: no version information available (required by /usr/bin/cmake)  
/usr/bin/cmake: /usr/local/lib/libcurl.so.4: no version information available (required by /usr/bin/cmake)  
/usr/bin/cmake: /usr/local/lib/libcurl.so.4: no version information available (required by /usr/bin/cmake)  
[88%] No test step for ‘cpp-feather-ini-parser-populate’  
/usr/bin/cmake: /usr/local/lib/libcurl.so.4: no version information available (required by /usr/bin/cmake)  
/usr/bin/cmake: /usr/local/lib/libcurl.so.4: no version information available (required by /usr/bin/cmake)  
/usr/bin/cmake: /usr/local/lib/libcurl.so.4: no version information available (required by /usr/bin/cmake)  
[100%] Completed ‘cpp-feather-ini-parser-populate’  
/usr/bin/cmake: /usr/local/lib/libcurl.so.4: no version information available (required by /usr/bin/cmake)  
/usr/bin/cmake: /usr/local/lib/libcurl.so.4: no version information available (required by /usr/bin/cmake)  
/usr/bin/cmake: /usr/local/lib/libcurl.so.4: no version information available (required by /usr/bin/cmake)  
/usr/bin/cmake: /usr/local/lib/libcurl.so.4: no version information available (required by /usr/bin/cmake)  
[100%] Built target cpp-feather-ini-parser-populate  
/usr/bin/cmake: /usr/local/lib/libcurl.so.4: no version information available (required by /usr/bin/cmake)  
– Populating rang  
/usr/bin/cmake: /usr/local/lib/libcurl.so.4: no version information available (required by /usr/bin/cmake)  
– Configuring done  
– Generating done  
– Build files have been written to: /home/dir/Documents/Archive/LimeSuiteNG/build/external/rang-subbuild  
/usr/bin/cmake: /usr/local/lib/libcurl.so.4: no version information available (required by /usr/bin/cmake)  
/usr/bin/cmake: /usr/local/lib/libcurl.so.4: no version information available (required by /usr/bin/cmake)  
/usr/bin/cmake: /usr/local/lib/libcurl.so.4: no version information available (required by /usr/bin/cmake)  
/usr/bin/cmake: /usr/local/lib/libcurl.so.4: no version information available (required by /usr/bin/cmake)  
/usr/bin/cmake: /usr/local/lib/libcurl.so.4: no version information available (required by /usr/bin/cmake)  
[11%] Creating directories for ‘rang-populate’  
/usr/bin/cmake: /usr/local/lib/libcurl.so.4: no version information available (required by /usr/bin/cmake)  
/usr/bin/cmake: /usr/local/lib/libcurl.so.4: no version information available (required by /usr/bin/cmake)  
/usr/bin/cmake: /usr/local/lib/libcurl.so.4: no version information available (required by /usr/bin/cmake)  
/usr/bin/cmake: /usr/local/lib/libcurl.so.4: no version information available (required by /usr/bin/cmake)  
/usr/bin/cmake: /usr/local/lib/libcurl.so.4: no version information available (required by /usr/bin/cmake)  
/usr/bin/cmake: /usr/local/lib/libcurl.so.4: no version information available (required by /usr/bin/cmake)  
/usr/bin/cmake: /usr/local/lib/libcurl.so.4: no version information available (required by /usr/bin/cmake)  
/usr/bin/cmake: /usr/local/lib/libcurl.so.4: no version information available (required by /usr/bin/cmake)  
/usr/bin/cmake: /usr/local/lib/libcurl.so.4: no version information available (required by /usr/bin/cmake)  
[22%] No download step for ‘rang-populate’  
/usr/bin/cmake: /usr/local/lib/libcurl.so.4: no version information available (required by /usr/bin/cmake)  
/usr/bin/cmake: /usr/local/lib/libcurl.so.4: no version information available (required by /usr/bin/cmake)  
/usr/bin/cmake: /usr/local/lib/libcurl.so.4: no version information available (required by /usr/bin/cmake)  
[33%] No update step for ‘rang-populate’  
/usr/bin/cmake: /usr/local/lib/libcurl.so.4: no version information available (required by /usr/bin/cmake)  
/usr/bin/cmake: /usr/local/lib/libcurl.so.4: no version information available (required by /usr/bin/cmake)  
/usr/bin/cmake: /usr/local/lib/libcurl.so.4: no version information available (required by /usr/bin/cmake)  
[44%] No patch step for ‘rang-populate’  
/usr/bin/cmake: /usr/local/lib/libcurl.so.4: no version information available (required by /usr/bin/cmake)  
/usr/bin/cmake: /usr/local/lib/libcurl.so.4: no version information available (required by /usr/bin/cmake)  
/usr/bin/cmake: /usr/local/lib/libcurl.so.4: no version information available (required by /usr/bin/cmake)  
[55%] No configure step for ‘rang-populate’  
/usr/bin/cmake: /usr/local/lib/libcurl.so.4: no version information available (required by /usr/bin/cmake)  
/usr/bin/cmake: /usr/local/lib/libcurl.so.4: no version information available (required by /usr/bin/cmake)  
/usr/bin/cmake: /usr/local/lib/libcurl.so.4: no version information available (required by /usr/bin/cmake)  
[66%] No build step for ‘rang-populate’  
/usr/bin/cmake: /usr/local/lib/libcurl.so.4: no version information available (required by /usr/bin/cmake)  
/usr/bin/cmake: /usr/local/lib/libcurl.so.4: no version information available (required by /usr/bin/cmake)  
/usr/bin/cmake: /usr/local/lib/libcurl.so.4: no version information available (required by /usr/bin/cmake)  
[77%] No install step for ‘rang-populate’  
/usr/bin/cmake: /usr/local/lib/libcurl.so.4: no version information available (required by /usr/bin/cmake)  
/usr/bin/cmake: /usr/local/lib/libcurl.so.4: no version information available (required by /usr/bin/cmake)  
/usr/bin/cmake: /usr/local/lib/libcurl.so.4: no version information available (required by /usr/bin/cmake)  
[88%] No test step for ‘rang-populate’  
/usr/bin/cmake: /usr/local/lib/libcurl.so.4: no version information available (required by /usr/bin/cmake)  
/usr/bin/cmake: /usr/local/lib/libcurl.so.4: no version information available (required by /usr/bin/cmake)  
/usr/bin/cmake: /usr/local/lib/libcurl.so.4: no version information available (required by /usr/bin/cmake)  
[100%] Completed ‘rang-populate’  
/usr/bin/cmake: /usr/local/lib/libcurl.so.4: no version information available (required by /usr/bin/cmake)  
/usr/bin/cmake: /usr/local/lib/libcurl.so.4: no version information available (required by /usr/bin/cmake)  
/usr/bin/cmake: /usr/local/lib/libcurl.so.4: no version information available (required by /usr/bin/cmake)  
/usr/bin/cmake: /usr/local/lib/libcurl.so.4: no version information available (required by /usr/bin/cmake)  
[100%] Built target rang-populate  
/usr/bin/cmake: /usr/local/lib/libcurl.so.4: no version information available (required by /usr/bin/cmake)  
– ##### #####  
– Linux Kernel release: 6.8.0-40-generic ()  
– Linux Kernel headers: /usr/src/linux-headers-6.8.0-40-generic  
– Performing Test HAVE\_CXX\_ATOMICS\_WITHOUT\_LIB  
– Performing Test HAVE\_CXX\_ATOMICS\_WITHOUT\_LIB - Success  
– Performing Test HAVE\_CXX\_ATOMICS64\_WITHOUT\_LIB  
– Performing Test HAVE\_CXX\_ATOMICS64\_WITHOUT\_LIB - Success  
– Looking for pthread.h  
– Looking for pthread.h - found  
– Performing Test CMAKE\_HAVE\_LIBC\_PTHREAD  
– Performing Test CMAKE\_HAVE\_LIBC\_PTHREAD - Success  
– Found Threads: TRUE  
– Found libusb-1.0:  
– - LIBUSB\_1\_INCLUDE\_DIRS: /usr/include/libusb-1.0  
– - LIBUSB\_1\_LIBRARIES: /usr/lib/x86\_64-linux-gnu/libusb-1.0.so  
– Could NOT find Gnuplot (missing: GNUPLOT\_EXECUTABLE)  
– Found wxWidgets: -L/usr/lib/x86\_64-linux-gnu;-pthread;;;-lwx\_gtk3u\_richtext-3.0;-lwx\_gtk3u\_adv-3.0;-lwx\_gtk3u\_core-3.0;-lwx\_baseu-3.0;-lwx\_gtk3u\_gl-3.0 (found version “3.0.5”)  
– wxWidgets\_DEFINITIONS: \_FILE\_OFFSET\_BITS=64;WXUSINGDLL; **WXGTK**  
– wxWidgets\_INCLUDE\_DIRS: /usr/lib/x86\_64-linux-gnu/wx/include/gtk3-unicode-3.0;/usr/include/wx-3.0  
– wxWidgets\_LIBRARIES: -L/usr/lib/x86\_64-linux-gnu;-pthread;;;-lwx\_gtk3u\_richtext-3.0;-lwx\_gtk3u\_adv-3.0;-lwx\_gtk3u\_core-3.0;-lwx\_baseu-3.0;-lwx\_gtk3u\_gl-3.0  
– Found OpenGL: /usr/lib/x86\_64-linux-gnu/libOpenGL.so  
– Found GLEW: /usr/include (found version “2.2.0”)  
– OPENGL\_INCLUDE\_DIR: /usr/include  
– OPENGL\_LIBRARIES: /usr/lib/x86\_64-linux-gnu/libOpenGL.so;/usr/lib/x86\_64-linux-gnu/libGLX.so;/usr/lib/x86\_64-linux-gnu/libGLU.so  
– ##### #####  
– ##### #####  
– ##### #####  
– Module limesuitengSupport configured with version: 1.0.0  
– ##### #####  
– ##### #####  
– PYTHON\_EXECUTABLE not set - using default python3  
– Found PythonInterp: /usr/local/bin/python3.10 (found version “3.10.13”)  
– Found PythonLibs: /usr/local/lib/libpython3.10.so (found suitable exact version “3.10.13”)  
– Found PkgConfig: /usr/bin/pkg-config (found version “0.29.2”)  
– Checking for module ‘gmp’  
– Found gmp, version 6.2.1  
– Found GMP: /usr/lib/x86\_64-linux-gnu/libgmpxx.so  
– Using GMP.  
– Using GMP.  
– Found MPLIB: /usr/lib/x86\_64-linux-gnu/libgmpxx.so  
– Found Boost: /usr/local/lib/cmake/Boost-1.74.0/BoostConfig.cmake (found suitable version “1.74.0”, minimum required is “1.74.0”) found components: date\_time program\_options system regex thread unit\_test\_framework  
– Found Volk: Volk::volk  
CMake Warning at plugins/gr-limesuiteng/CMakeLists.txt:76 (message):  
Currently used compiler version (11.4.0) does not match GNURadio compiler.

```
      GNURadio compiled with (c++ (Ubuntu 11.2.0-19ubuntu1) 11.2.0 

```

Copyright (C) 2021 Free Software Foundation, Inc.

This is free software see the source for copying conditions. There is NO

warranty not even for MERCHANTABILITY or FITNESS FOR A PARTICULAR  
PURPOSE.).

```
      This can result in gnuradio-companion Python bindings failure to import symbols, if the compiler major versions are different.

```

– Performing Test HAVE\_VISIBILITY\_HIDDEN  
– Performing Test HAVE\_VISIBILITY\_HIDDEN - Success  
– Performing Test HAVE\_WARN\_SIGN\_COMPARE  
– Performing Test HAVE\_WARN\_SIGN\_COMPARE - Success  
– Performing Test HAVE\_WARN\_ALL  
– Performing Test HAVE\_WARN\_ALL - Success  
– Performing Test HAVE\_WARN\_NO\_UNINITIALIZED  
– Performing Test HAVE\_WARN\_NO\_UNINITIALIZED - Success  
– Found Git: /usr/bin/git  
– Extracting version information from git describe…  
– Found Doxygen: /usr/bin/doxygen (found version “1.9.1”) found components: doxygen missing components: dot  
CMake Warning (dev) at plugins/gr-limesuiteng/CMakeLists.txt:169 (message):  
Parent project has already defined ‘uninstall’ target, gnuradio-limesuiteng  
will not have it’s own uninstall.  
This warning is for project developers. Use -Wno-dev to suppress it.

– Using install prefix: /usr/local  
– Building for version: 1.0.0.0 / 1.0.0  
– No C++ unit tests… skipping  
– PYTHON and GRC components are enabled  
– Python checking for pygccxml - found  
CMake Warning (dev) at plugins/gr-limesuiteng/python/limesuiteng/bindings/CMakeLists.txt:24 (message):  
host GnuRadio version 3.10.1.1, overriding it’s GrPybind cmake file to work  
for nested projects.  
This warning is for project developers. Use -Wno-dev to suppress it.

## – Found PythonInterp: /usr/bin/python3 (found version “3.10.12”) – Found PythonLibs: /usr/local/lib/libpython3.10.so – Performing Test HAS\_FLTO – Performing Test HAS\_FLTO - Success – Found pybind11: /usr/include (found version “2.9.1”) – ##### ##### – Found Doxygen: /usr/bin/doxygen (found version “1.9.1”) found components: doxygen missing components: dot mscgen dia

– ######################################################  
– Packages found:

- LinuxKernelHeaders
- libusb-1.0  
Adds USB communication support
- wxWidgets
- OpenGL
- GLEW
- kissfft
- SoapySDR  
Adds LimeSuiteNG bindings for SoapySDR
- PythonLibs (required version == 3.10)
- Threads
- PkgConfig
- GMP
- boost\_headers (required version == 1.74.0)
- boost\_date\_time (required version == 1.74.0)
- boost\_program\_options (required version == 1.74.0)
- boost\_system (required version == 1.74.0)
- boost\_regex (required version == 1.74.0)
- boost\_thread (required version == 1.74.0)
- boost\_unit\_test\_framework (required version == 1.74.0)
- Boost (required version \>= 1.74.0)
- Gnuradio (required version \>= 3.10)
- Git
- PythonInterp
- PythonLibsNew
- pybind11
- Doxygen

– ######################################################  
– Missing required packages:

– ######################################################  
– Missing recommended packages:

– ######################################################  
– Missing optional packages:

- Gnuplot

## – ###################################################### – ## limesuiteng enabled features – ######################################################

- BUILD\_DRIVERS, Build device drivers
- BUILD\_DRIVERS\_LIMEPCIE, Build limepcie driver
- LIMEPCIE\_INSTALL, Install limepcie kernel module to system
- LIMEPCIE\_RELOAD\_ON\_INSTALL, Reload limepcie kernel module after install
- BUILD\_CORE, limesuiteng core library
- INSTALL\_DEVELOPMENT, Install limesuiteng headers & development files
- LIMESUITENG\_USB\_FTDI, USB support for FTDI
- LIMESUITENG\_USB\_FX3, USB support for Cypress FX3
- LIMESUITENG\_PCIE, PCIe support
- BUILD\_EXAMPLES, LimeSuiteNG API examples
- BUILD\_CLI, command line interface applications
- BUILD\_GUI, graphical user interface application (limeGUI)
- BUILD\_PLUGINS, plugins for external software packages
- BUILD\_PLUGINS\_AMARISOFT, Build LimeSuiteNG plugin for Amarisoft
- INSTALL\_FREEDESKTOP, LimeSuiteNG freedesktop integration
- BUILD\_PLUGINS\_SOAPYSDR, SoapySDR bindings for LimeSuiteNG
- BUILD\_PLUGINS\_GNURADIO, GNU Radio 3.9+ Plug-in
- INSTALL\_UDEV\_RULES, Install Linux udev rules for LimeSDR devices
- UDEV\_RULES\_RELOAD\_ON\_INSTALL, Reload UDEV rules after install
- BUILD\_DOCS, Build documentation
- BUILD\_DOCS\_DOXYGEN, Build Doxygen based documentation

## – ###################################################### – ## limesuiteng disabled features – ######################################################

- LIMEPCIE\_DKMS, Use DKMS system to build/install limepcie module

– Install prefix: /usr/local  
– Build timestamp:  
– Lime Suite version:  
– ABI/so version:  
– Configuring done  
– Generating done  
– Build files have been written to: /home/dir/Documents/Archive/LimeSuiteNG/build  
dir-Z390-UD:~/Documents/Archive/LimeSuiteNG/build\> make  
/usr/bin/cmake: /usr/local/lib/libcurl.so.4: no version information available (required by /usr/bin/cmake)  
/usr/bin/cmake: /usr/local/lib/libcurl.so.4: no version information available (required by /usr/bin/cmake)  
/usr/bin/cmake: /usr/local/lib/libcurl.so.4: no version information available (required by /usr/bin/cmake)  
/usr/bin/cmake: /usr/local/lib/libcurl.so.4: no version information available (required by /usr/bin/cmake)  
[0%] Building Linux kernel module (limepcie) in dir: /home/dir/Documents/Archive/LimeSuiteNG/build/drivers/linux/limepcie/limepcie-0.1.9  
warning: the compiler differs from the one used to build the kernel  
The kernel was built by: x86\_64-linux-gnu-gcc-12 (Ubuntu 12.3.0-1ubuntu1~22.04) 12.3.0  
You are using:  
/bin/sh: 1: gcc-12: not found  
make[5]: \*\*\* [scripts/Makefile.build:243: /home/dir/Documents/Archive/LimeSuiteNG/build/drivers/linux/limepcie/limepcie-0.1.9/limepcie\_core.o] Error 127  
make[4]: \*\*\* [/usr/src/linux-headers-6.8.0-40-generic/Makefile:1926: /home/dir/Documents/Archive/LimeSuiteNG/build/drivers/linux/limepcie/limepcie-0.1.9] Error 2  
make[3]: \*\*\* [Makefile:240: \_\_sub-make] Error 2  
make[2]: \*\*\* [drivers/linux/limepcie/CMakeFiles/limepcie.dir/build.make:84: drivers/linux/limepcie/limepcie-0.1.9/limepcie.ko] Error 2  
make[1]: \*\*\* [CMakeFiles/Makefile2:1162: drivers/linux/limepcie/CMakeFiles/limepcie.dir/all] Error 2  
make: \*\*\* [Makefile:136: all] Error 2  
dir-Z390-UD:~/Documents/Archive/LimeSuiteNG/build\>

---

<div class="post-metadata">

**Author:** ![ricardas](https://yyz2.discourse-cdn.com/flex034/user_avatar/discourse.myriadrf.org/ricardas/32/86_2.png) [@ricardas](https://discourse.myriadrf.org/u/ricardas)\
**Post date:** [15 February 2025 20:01 UTC](https://discourse.myriadrf.org/t/limesuiteng-will-not-build-on-ubuntu-22-04/8652/2 "2025-02-15T20:01:00Z")

</div>

The driver module has to be compiled with the same compiler version that was used to build the kernel (`The kernel was built by: x86_64-linux-gnu-gcc-12 (Ubuntu 12.3.0-1ubuntu1~22.04) 12.3.0`)

Your system does not have installed the same compiler version `/bin/sh: 1: gcc-12: not found`

install it with “sudo apt-get install gcc-12”

---

<div class="post-metadata">

**Author:** ![RightHalfPlane](https://avatars.discourse-cdn.com/v4/letter/r/46a35a/32.png) [@RightHalfPlane](https://discourse.myriadrf.org/u/RightHalfPlane)\
**Post date:** [16 February 2025 00:30 UTC](https://discourse.myriadrf.org/t/limesuiteng-will-not-build-on-ubuntu-22-04/8652/3 "2025-02-16T00:30:09Z")

</div>

It builds and it installs Ok, but it has problems with programs.

CubicSDR crashes when you select the limeMini v2.0.  
GQRX errors with “[ERROR] No samples or timeout”.  
SdrGlut crashes because the libSoapySDR routine listSampleRates returns no rates.  
iqSDR.x runs OK because there is an option to input the desired rate when listSampleRates fails.

Here is the console output -

dir-Z390-UD:~\> sdrglut.x  
LIQUID\_VERSION\_NUMBER 1003002  
Lib Version: v0.8.1-2build1  
API Version: v0.8.0  
ABI Version: v0.8  
Install root: /usr  
Search path: /usr/lib/x86\_64-linux-gnu/SoapySDR/modules0.8  
Search path: /usr/local/lib/x86\_64-linux-gnu/SoapySDR/modules0.8  
Search path: /usr/local/lib/SoapySDR/modules0.8  
Module found: /usr/lib/x86\_64-linux-gnu/SoapySDR/modules0.8/libHackRFSupport.so  
Module found: /usr/lib/x86\_64-linux-gnu/SoapySDR/modules0.8/libPlutoSDRSupport.so  
Module found: /usr/lib/x86\_64-linux-gnu/SoapySDR/modules0.8/libRedPitaya.so  
Module found: /usr/lib/x86\_64-linux-gnu/SoapySDR/modules0.8/libairspySupport.so  
Module found: /usr/lib/x86\_64-linux-gnu/SoapySDR/modules0.8/libaudioSupport.so  
Module found: /usr/lib/x86\_64-linux-gnu/SoapySDR/modules0.8/libbladeRFSupport.so  
Module found: /usr/lib/x86\_64-linux-gnu/SoapySDR/modules0.8/libmiriSupport.so  
Module found: /usr/lib/x86\_64-linux-gnu/SoapySDR/modules0.8/libosmosdrSupport.so  
Module found: /usr/lib/x86\_64-linux-gnu/SoapySDR/modules0.8/libremoteSupport.so  
Module found: /usr/lib/x86\_64-linux-gnu/SoapySDR/modules0.8/librfspaceSupport.so  
Module found: /usr/lib/x86\_64-linux-gnu/SoapySDR/modules0.8/librtlsdrSupport.so  
Module found: /usr/lib/x86\_64-linux-gnu/SoapySDR/modules0.8/libuhdSupport.so  
Module found: /usr/local/lib/SoapySDR/modules0.8/libairspyhfSupport.so  
Module found: /usr/local/lib/SoapySDR/modules0.8/liblimesuitengSupport.so  
Module found: /usr/local/lib/SoapySDR/modules0.8/libsdrPlaySupport.so  
[INFO] [UHD] linux; GNU C++ version 11.4.0; Boost\_107400; UHD\_4.1.0.0-0-unknown  
default\_input=True  
default\_output=False  
device\_id=0  
driver=audio  
default\_input=False  
default\_output=False  
device\_id=3  
driver=audio  
addr=0403:601f  
driver=limesuiteng  
label=LimeSDR Mini 1DA1546B7D43FB  
name=LimeSDR Mini  
serial=1DA1546B7D43FB  
X Error of failed request: BadValue (integer parameter out of range for operation)  
Major opcode of failed request: 12 (X\_ConfigureWindow)  
Value in failed request: 0x0  
Serial number of failed request: 2404  
Current serial number in output stream: 2406  
AL lib: (EE) alc\_cleanup: 1 device not closed  
dir-Z390-UD:~\> iqSDR.x  
Number of Devices : 4  
audio device = 0 : input channels = 2 Device Name = Monitor of Built-in Audio Analog Stereo sampleRates = 8000 16000 22050 32000 44100 48000 96000 192000  
audio device = 1 : output channels = 2 Device Name = Built-in Audio Analog Stereo sampleRates = 8000 16000 22050 32000 44100 48000 96000 192000  
audio device = 2 : output channels = 2 Device Name = TU106 High Definition Audio Controller Digital Stereo (HDMI) sampleRates = 8000 16000 22050 32000 44100 48000 96000 192000  
audio device = 3 : input channels = 2 Device Name = Monitor of TU106 High Definition Audio Controller Digital Stereo (HDMI) sampleRates = 8000 16000 22050 32000 44100 48000 96000 192000  
deviceString 0x5c2a92f15fc0  
[INFO] [UHD] linux; GNU C++ version 11.4.0; Boost\_107400; UHD\_4.1.0.0-0-unknown  
Number of Devices Found: 3  
SDR device = 0 label = Monitor of Built-in Audio Analog Stereo  
SDR device = 1 label = Monitor of TU106 High Definition Audio Controller Digital Stereo (HDMI)  
SDR device = 2 label = LimeSDR Mini 1DA1546B7D43FB

device = 2 selected  
addr = 0403:601f driver = limesuiteng label = LimeSDR Mini 1DA1546B7D43FB name = LimeSDR Mini serial = 1DA1546B7D43FB

driver = limesuiteng  
hardware = LimeSDR-Mini\_v2  
boardSerialNumber = 0x1da1546b7d43fb firmwareVersion = 10 gatewareVersion = 2 hardwareVersion = 7 protocolVersion = 1

Rx antennas:  
NONE  
LNAH  
LNAL\_NC  
LNAW

Setting Info:  
key SAVE\_CONFIG value read type 3 min 0 max 0 step 0  
key LOAD\_CONFIG value read type 3 min 0 max 0 step 0  
key OVERSAMPLING value read 0 type 1 min 0 max 0 step 0

RX StreamFormats 0 CF32  
RX StreamFormats 1 CS12  
RX StreamFormats 2 CS16

RF Gain range RX min -12 max 61  
FrequencyRange min 1e+07 max 3.5e+09

Gains:  
0 LNA range max 30 min 0  
1 PGA range max 19 min -12  
2 TIA range max 12 min 0

samplerate 2e+07  
hasGainMode: 0  
hasFrequencyCorrection: 0  
MTU 8160  
rate 20000000.000000 rx-\>size 1000000  
Audio Record 304 No Data  
dir-Z390-UD:~\> CubicSDR  
Loading:: configuration file ‘/home/dir/.CubicSDR/config.xml’  
Loaded 262 rig models via hamlib.

Audio Device #0 Monitor of Built-in Audio Analog Stereo  
Default Output? No  
Default Input? Yes  
Input channels: 2  
Output channels: 0  
Duplex channels: 0  
Native formats:  
16-bit signed integer.  
24-bit signed integer.  
32-bit signed integer.  
32-bit float normalized between plus/minus 1.0.  
Supported sample rates:  
8000hz  
16000hz  
22050hz  
32000hz  
44100hz  
48000hz  
96000hz  
192000hz

Audio Device #1 Built-in Audio Analog Stereo  
Default Output? Yes  
Default Input? No  
Input channels: 0  
Output channels: 2  
Duplex channels: 0  
Native formats:  
16-bit signed integer.  
24-bit signed integer.  
32-bit signed integer.  
32-bit float normalized between plus/minus 1.0.  
Supported sample rates:  
8000hz  
16000hz  
22050hz  
32000hz  
44100hz  
48000hz  
96000hz  
192000hz

Audio Device #2 TU106 High Definition Audio Controller Digital Stereo (HDMI)  
Default Output? No  
Default Input? No  
Input channels: 0  
Output channels: 2  
Duplex channels: 0  
Native formats:  
16-bit signed integer.  
24-bit signed integer.  
32-bit signed integer.  
32-bit float normalized between plus/minus 1.0.  
Supported sample rates:  
8000hz  
16000hz  
22050hz  
32000hz  
44100hz  
48000hz  
96000hz  
192000hz

Audio Device #3 Monitor of TU106 High Definition Audio Controller Digital Stereo (HDMI)  
Default Output? No  
Default Input? No  
Input channels: 2  
Output channels: 0  
Duplex channels: 0  
Native formats:  
16-bit signed integer.  
24-bit signed integer.  
32-bit signed integer.  
32-bit float normalized between plus/minus 1.0.  
Supported sample rates:  
8000hz  
16000hz  
22050hz  
32000hz  
44100hz  
48000hz  
96000hz  
192000hz

SDR enumerator starting.  
SoapySDR init…  
API Version: v0.8.0  
ABI Version: v0.8  
Install root: /usr  
Loading modules…  
Available factories…airspy, airspyhf, audio, bladerf, hackrf, limesuiteng, miri, null, osmosdr, plutosdr, redpitaya, remote, rfspace, rtlsdr, sdrplay, uhd  
[INFO] [UHD] linux; GNU C++ version 11.4.0; Boost\_107400; UHD\_4.1.0.0-0-unknown  
Available vertical sync SwapInterval functions:  
glxSwapIntervalEXT: Yes  
DRI2SwapInterval: No  
glxSwapIntervalMESA: Yes  
glxSwapIntervalSGI: Yes  
Using glxSwapIntervalEXT.

Loaded font ‘Bitstream Vera Sans Mono’ from ‘/usr/share/cubicsdr/fonts/vera\_sans\_mono12\_0.png’, parsed 255 characters.  
Loaded font ‘Bitstream Vera Sans Mono’ from ‘/usr/share/cubicsdr/fonts/vera\_sans\_mono16\_0.png’, parsed 255 characters.  
Loaded font ‘Bitstream Vera Sans Mono’ from ‘/usr/share/cubicsdr/fonts/vera\_sans\_mono18\_0.png’, parsed 255 characters.  
Loaded font ‘Bitstream Vera Sans Mono’ from ‘/usr/share/cubicsdr/fonts/vera\_sans\_mono24\_0.png’, parsed 255 characters.  
Loaded font ‘Bitstream Vera Sans Mono’ from ‘/usr/share/cubicsdr/fonts/vera\_sans\_mono27\_0.png’, parsed 255 characters.  
default\_input = True  
default\_output = False  
device\_id = 0  
driver = audio  
label = Monitor of Built-in Audio Analog Stereo  
Make device 0  
device\_id=0  
origin=[GitHub - pothosware/SoapyAudio: Soapy SDR plugin for Audio devices](https://github.com/pothosware/SoapyAudio)

default\_input = False  
default\_output = False  
device\_id = 3  
driver = audio  
label = Monitor of TU106 High Definition Audio Controller Digital Stereo (HDMI)  
Make device 1  
device\_id=3  
origin=[GitHub - pothosware/SoapyAudio: Soapy SDR plugin for Audio devices](https://github.com/pothosware/SoapyAudio)

addr = 0403:601f  
driver = limesuiteng  
label = LimeSDR Mini 1DA1546B7D43FB  
name = LimeSDR Mini  
serial = 1DA1546B7D43FB  
Make device 2  
[INFO] Make connection: ‘LimeSDR Mini 1DA1546B7D43FB’  
[INFO] Reference clock 40.00 MHz  
[INFO] Device name: LimeSDR-Mini\_v2  
[INFO] Reference: 40 MHz  
[INFO] LMS7002M register cache: Disabled  
boardSerialNumber=0x1da1546b7d43fb  
firmwareVersion=10  
gatewareVersion=2  
hardwareVersion=7  
protocolVersion=1

192.168.1.2:50000 =  
driver = rfspace  
label = Not Found (rfspace)  
Make device 3

192.168.1.2:50000 =  
driver = rfspace  
label = Not Found (rfspace)  
Make device 4

Reporting enumeration complete.  
SDR enumerator done.  
[INFO] Make connection: ‘LimeSDR Mini 1DA1546B7D43FB’  
[INFO] Reference clock 40.00 MHz  
[INFO] Device name: LimeSDR-Mini\_v2  
[INFO] Reference: 40 MHz  
[INFO] LMS7002M register cache: Disabled  
Segmentation fault (core dumped)  
dir-Z390-UD:~\> gqrx  
Warning: Ignoring XDG\_SESSION\_TYPE=wayland on Gnome. Use QT\_QPA\_PLATFORM=wayland to run on Wayland anyway.  
gr-osmosdr 0.2.0.0 (0.2.0) gnuradio 3.10.1.1  
built-in source types: file fcd rtl rtl\_tcp uhd hackrf bladerf rfspace airspy airspyhf soapy redpitaya freesrp  
file\_source ⚠ file size is not a multiple of item size  
rx\_nb\_cc :info: set\_min\_output\_buffer on block 12 to 32768  
Resampling audio 96000 → 48000  
BandPlanFile is /home/dir/.config/gqrx/bandplan.csv  
BookmarksFile is /home/dir/.config/gqrx/bookmarks.csv  
[INFO] [UHD] linux; GNU C++ version 11.4.0; Boost\_107400; UHD\_4.1.0.0-0-unknown  
libusb: warning [libusb\_exit] device 2.2 still referenced  
libusb: warning [libusb\_exit] device 2.1 still referenced  
libusb: warning [libusb\_exit] device 1.4 still referenced  
libusb: warning [libusb\_exit] device 1.3 still referenced  
libusb: warning [libusb\_exit] device 1.2 still referenced  
libusb: warning [libusb\_exit] device 1.1 still referenced  
libusb: warning [libusb\_exit] device 4.1 still referenced  
libusb: warning [libusb\_exit] device 3.1 still referenced  
gr-osmosdr 0.2.0.0 (0.2.0) gnuradio 3.10.1.1  
built-in source types: file fcd rtl rtl\_tcp uhd hackrf bladerf rfspace airspy airspyhf soapy redpitaya freesrp  
[INFO] Make connection: ‘LimeSDR Mini 1DA1546B7D43FB’  
[INFO] Reference clock 40.00 MHz  
[INFO] Device name: LimeSDR-Mini\_v2  
[INFO] Reference: 40 MHz  
[INFO] LMS7002M register cache: Disabled  
[INFO] Sampling rate set(10.003 MHz): CGEN:320.104 MHz, Decim: 2^3, Interp: 2^3  
[INFO] Sampling rate set(5.000 MHz): CGEN:640.000 MHz, Decim: 2^5, Interp: 2^5  
[INFO] Rx LPF configured  
gr-osmosdr 0.2.0.0 (0.2.0) gnuradio 3.10.1.1  
built-in source types: file fcd rtl rtl\_tcp uhd hackrf bladerf rfspace airspy airspyhf soapy redpitaya freesrp  
[INFO] Make connection: ‘LimeSDR Mini 1DA1546B7D43FB’  
[INFO] Reference clock 40.00 MHz  
[INFO] Device name: LimeSDR-Mini\_v2  
[INFO] Reference: 40 MHz  
[INFO] LMS7002M register cache: Disabled  
[INFO] Sampling rate set(10.003 MHz): CGEN:320.104 MHz, Decim: 2^3, Interp: 2^3  
[INFO] Sampling rate set(5.000 MHz): CGEN:640.000 MHz, Decim: 2^5, Interp: 2^5  
[INFO] Rx LPF configured  
[ERROR] No samples or timeout  
[ERROR] No samples or timeout  
[ERROR] No samples or timeout  
[ERROR] No samples or timeout  
[ERROR] No samples or timeout  
[ERROR] No samples or timeout  
[ERROR] No samples or timeout  
[ERROR] No samples or timeout  
[ERROR] No samples or timeout  
[ERROR] No samples or timeout  
[ERROR] No samples or timeout  
[ERROR] No samples or timeout  
[ERROR] No samples or timeout  
[ERROR] No samples or timeout  
[ERROR] No samples or timeout  
[ERROR] No samples or timeout  
[ERROR] No samples or timeout  
[ERROR] No samples or timeout  
[ERROR] No samples or timeout  
[ERROR] No samples or timeout  
dir-Z390-UD:~\>
