# CS-lime-01 Board test failure

**URL:** https://discourse.myriadrf.org/t/cs-lime-01-board-test-failure/6776
**Category:** LimeSDR
**Created:** [14 December 2020 08:07 UTC](https://discourse.myriadrf.org/t/cs-lime-01-board-test-failure/6776 "2020-12-14T08:07:11Z")
**Posts on this page:** 8
**Page:** 1

<div class="post-metadata">

### Author: ![rohit.soni](https://avatars.discourse-cdn.com/v4/letter/r/bc79bd/32.png) [@rohit.soni](https://discourse.myriadrf.org/u/rohit.soni)
#### Post date: [14 December 2020 08:07 UTC](https://discourse.myriadrf.org/t/cs-lime-01-board-test-failure/6776/1 "2020-12-14T08:07:11Z")

</div>

HI ,  
I have one board which fails in quick test and also gets very hot. Logs attached. Do anyone has idea what could possibly go wrong?

 ![image](https://canada1.discourse-cdn.com/flex034/uploads/myriadrf/original/2X/4/407277fc327310899146cd6234d01a5ee3c8608a.png)

logs:  
[TESTING STARTED]  
-\>Start time: Mon Dec 14 13:09:10 2020  
-\>LimeSuite version: 20.10.0-g1480bfea

Gateware version mismatch!  
Expected gateware version 2, revision 23  
But found version 2, revision 22  
Follow the FW and FPGA upgrade instructions:  
[Lime Suite - Myriad-RF Wiki](http://wiki.myriadrf.org/Lime_Suite#Flashing_images)  
Or run update on the command line: LimeUtil --update

-\>Device: LimeSDR-USB, media=USB 3.0, module=FX3, serial=0009081C05C1281D, index=0, HW=4, GW=2.22  
Serial Number: 0009081C05C1281D  
Chip temperature: 45 C

[Clock Network Test]  
-\>FX3 GPIF clock test  
Test results: 32315; 36071; 39827 - PASSED  
-\>Si5351C test  
CLK0: 17554 / 17554 - PASSED  
CLK1: 17554 / 17554 - PASSED  
CLK2: 17554 / 17554 - PASSED  
CLK3: 17554 / 17554 - PASSED  
CLK4: 17554 / 17554 - PASSED  
CLK5: 17554 / 17554 - PASSED  
CLK6: 17554 / 17554 - PASSED  
-\>ADF4002 Test  
Result: 10 - PASSED  
-\>VCTCXO test  
Results : 5112941 (min); 5113081 (max) - PASSED  
-\>Clock Network Test PASSED

[FPGA EEPROM Test]  
-\>Read EEPROM  
-\>Read data: 13 01 18 13 01 18 02  
-\>FPGA EEPROM Test PASSED

[LMS7002M Test]  
-\>Perform Registers Test  
-\>External Reset line test  
Reg 0x20: Write value 0xFFFD, Read value 0xFFFD  
Reg 0x20: value after reset 0x0FFFF  
-\>LMS7002M Test PASSED

[RF Loopback Test]  
Note: The test should be run without anything connected to RF ports  
-\>Configure LMS  
-\>Run Tests (TX\_2-\> LNA\_L):  
CH0 (SXR=800.0MHz, SXT=805.0MHz): Result:(-15.2 dBFS, 5.00 MHz) - PASSED  
CH1 (SXR=800.0MHz, SXT=805.0MHz): Result:(-17.6 dBFS, 5.00 MHz) - PASSED  
-\>Run Tests (TX\_1 → LNA\_W):  
CH0 (SXR=1800.0MHz, SXT=1805.0MHz): Result:(-43.3 dBFS, -20.00 MHz) - FAILED  
CH1 (SXR=1800.0MHz, SXT=1805.0MHz): Result:(-20.3 dBFS, 5.00 MHz) - PASSED  
-\>Run Tests (TX\_2-\> LNA\_H):  
CH0 (SXR=2500.0MHz, SXT=2505.0MHz): Result:(-17.0 dBFS, 5.00 MHz) - PASSED  
CH1 (SXR=2500.0MHz, SXT=2505.0MHz): Result:(-15.3 dBFS, 5.00 MHz) - PASSED  
-\>RF Loopback Test FAILED

=\> Board tests FAILED \<=

Elapsed time: 6.61 seconds

[TESTING STARTED]  
-\>Start time: Mon Dec 14 13:22:44 2020  
-\>LimeSuite version: 20.10.0-g1480bfea

Gateware version mismatch!  
Expected gateware version 2, revision 23  
But found version 2, revision 22  
Follow the FW and FPGA upgrade instructions:  
[Lime Suite - Myriad-RF Wiki](http://wiki.myriadrf.org/Lime_Suite#Flashing_images)  
Or run update on the command line: LimeUtil --update

-\>Device: LimeSDR-USB, media=USB 3.0, module=FX3, serial=0009081C05C1281D, index=0, HW=4, GW=2.22  
Serial Number: 0009081C05C1281D  
Chip temperature: 37 C

[Clock Network Test]  
-\>FX3 GPIF clock test  
Test results: 27922; 31678; 35434 - PASSED  
-\>Si5351C test  
CLK0: 17554 / 17554 - PASSED  
CLK1: 17554 / 17554 - PASSED  
CLK2: 17554 / 17554 - PASSED  
CLK3: 17554 / 17554 - PASSED  
CLK4: 17554 / 17554 - PASSED  
CLK5: 17554 / 17554 - PASSED  
CLK6: 17554 / 17554 - PASSED  
-\>ADF4002 Test  
Result: 10 - PASSED  
-\>VCTCXO test  
Results : 5112941 (min); 5113081 (max) - PASSED  
-\>Clock Network Test PASSED

[FPGA EEPROM Test]  
-\>Read EEPROM  
-\>Read data: 13 01 18 13 01 18 02  
-\>FPGA EEPROM Test PASSED

[LMS7002M Test]  
-\>Perform Registers Test  
-\>External Reset line test  
Reg 0x20: Write value 0xFFFD, Read value 0xFFFD  
Reg 0x20: value after reset 0x0FFFF  
-\>LMS7002M Test PASSED

[RF Loopback Test]  
Note: The test should be run without anything connected to RF ports  
-\>Configure LMS  
-\>Run Tests (TX\_2-\> LNA\_L):  
CH0 (SXR=800.0MHz, SXT=805.0MHz): Result:(-14.5 dBFS, 5.00 MHz) - PASSED  
CH1 (SXR=800.0MHz, SXT=805.0MHz): Result:(-16.8 dBFS, 5.00 MHz) - PASSED  
-\>Run Tests (TX\_1 → LNA\_W):  
CH0 (SXR=1800.0MHz, SXT=1805.0MHz): Result:(-43.5 dBFS, -20.00 MHz) - FAILED  
CH1 (SXR=1800.0MHz, SXT=1805.0MHz): Result:(-19.0 dBFS, 5.00 MHz) - PASSED  
-\>Run Tests (TX\_2-\> LNA\_H):  
CH0 (SXR=2500.0MHz, SXT=2505.0MHz): Result:(-17.3 dBFS, 5.00 MHz) - PASSED  
CH1 (SXR=2500.0MHz, SXT=2505.0MHz): Result:(-15.8 dBFS, 5.00 MHz) - PASSED  
-\>RF Loopback Test FAILED

=\> Board tests FAILED \<=

Elapsed time: 6.72 seconds

[TESTING STARTED]  
-\>Start time: Mon Dec 14 13:29:23 2020  
-\>LimeSuite version: 20.10.0-g1480bfea

Gateware version mismatch!  
Expected gateware version 2, revision 23  
But found version 2, revision 22  
Follow the FW and FPGA upgrade instructions:  
[Lime Suite - Myriad-RF Wiki](http://wiki.myriadrf.org/Lime_Suite#Flashing_images)  
Or run update on the command line: LimeUtil --update

-\>Device: LimeSDR-USB, media=USB 3.0, module=FX3, serial=0009081C05C1281D, index=0, HW=4, GW=2.22  
Serial Number: 0009081C05C1281D  
Chip temperature: 34 C

[Clock Network Test]  
-\>FX3 GPIF clock test  
Test results: 28795; 32551; 36307 - PASSED  
-\>Si5351C test  
CLK0: 17554 / 17554 - PASSED  
CLK1: 17554 / 17554 - PASSED  
CLK2: 17554 / 17554 - PASSED  
CLK3: 17554 / 17554 - PASSED  
CLK4: 17554 / 17554 - PASSED  
CLK5: 17554 / 17554 - PASSED  
CLK6: 17554 / 17554 - PASSED  
-\>ADF4002 Test  
Result: 10 - PASSED  
-\>VCTCXO test  
Results : 5112941 (min); 5113080 (max) - PASSED  
-\>Clock Network Test PASSED

[FPGA EEPROM Test]  
-\>Read EEPROM  
-\>Read data: 13 01 18 13 01 18 02  
-\>FPGA EEPROM Test PASSED

[LMS7002M Test]  
-\>Perform Registers Test  
-\>External Reset line test  
Reg 0x20: Write value 0xFFFD, Read value 0xFFFD  
Reg 0x20: value after reset 0x0FFFF  
-\>LMS7002M Test PASSED

[RF Loopback Test]  
Note: The test should be run without anything connected to RF ports  
-\>Configure LMS  
-\>Run Tests (TX\_2-\> LNA\_L):  
CH0 (SXR=800.0MHz, SXT=805.0MHz): Result:(-14.3 dBFS, 5.00 MHz) - PASSED  
CH1 (SXR=800.0MHz, SXT=805.0MHz): Result:(-16.3 dBFS, 5.00 MHz) - PASSED  
-\>Run Tests (TX\_1 → LNA\_W):  
CH0 (SXR=1800.0MHz, SXT=1805.0MHz): Result:(-43.1 dBFS, -20.00 MHz) - FAILED  
CH1 (SXR=1800.0MHz, SXT=1805.0MHz): Result:(-18.5 dBFS, 5.00 MHz) - PASSED  
-\>Run Tests (TX\_2-\> LNA\_H):  
CH0 (SXR=2500.0MHz, SXT=2505.0MHz): Result:(-16.2 dBFS, 5.00 MHz) - PASSED  
CH1 (SXR=2500.0MHz, SXT=2505.0MHz): Result:(-14.9 dBFS, 5.00 MHz) - PASSED  
-\>RF Loopback Test FAILED

=\> Board tests FAILED \<=

Elapsed time: 6.50 seconds

---

<div class="post-metadata">

### Author: ![andrewback](https://avatars.discourse-cdn.com/v4/letter/a/22d042/32.png) [@andrewback](https://discourse.myriadrf.org/u/andrewback)
#### Post date: [14 December 2020 14:14 UTC](https://discourse.myriadrf.org/t/cs-lime-01-board-test-failure/6776/2 "2020-12-14T14:14:32Z")

</div>

Looks like there may be damage to a Tx/LNA port.

@Zack, do you have anything to suggest?

---

<div class="post-metadata">

### Author: ![Zack](https://yyz2.discourse-cdn.com/flex034/user_avatar/discourse.myriadrf.org/zack/32/89_2.png) [@Zack](https://discourse.myriadrf.org/u/Zack)
#### Post date: [14 December 2020 16:43 UTC](https://discourse.myriadrf.org/t/cs-lime-01-board-test-failure/6776/3 "2020-12-14T16:43:38Z")

</div>

Hi @rohit.soni,

Update the firmware to the latest and try LimeQuickTest again, please. If the same problem remains, then contact CrowdSupply for replacement.

---

<div class="post-metadata">

### Author: ![rohit.soni](https://avatars.discourse-cdn.com/v4/letter/r/bc79bd/32.png) [@rohit.soni](https://discourse.myriadrf.org/u/rohit.soni)
#### Post date: [16 December 2020 11:44 UTC](https://discourse.myriadrf.org/t/cs-lime-01-board-test-failure/6776/4 "2020-12-16T11:44:32Z")

</div>

> [@Zack](#):
>
> Update the firmware to the latest and try LimeQuickTest again, please. If the same problem remains, then contact CrowdSupply for replacement.

Hi @Zack,  
Did update on the same board. The firmware still did not updated and the LimeUtil --update command says no need to update and stays on 22 version.  
logs below after running test again.  
[TESTING STARTED]  
-\>Start time: Wed Dec 16 11:18:59 2020  
-\>LimeSuite version: 20.10.0-g1480bfea

Gateware version mismatch!  
Expected gateware version 2, revision 23  
But found version 2, revision 22  
Follow the FW and FPGA upgrade instructions:  
[Lime Suite - Myriad-RF Wiki](http://wiki.myriadrf.org/Lime_Suite#Flashing_images)  
Or run update on the command line: LimeUtil --update

-\>Device: LimeSDR-USB, media=USB 3.0, module=FX3, serial=0009081C05C1281D, index=0, HW=4, GW=2.22  
Serial Number: 0009081C05C1281D  
Chip temperature: 45 C

[Clock Network Test]  
-\>FX3 GPIF clock test  
Test results: 19835; 23591; 27347 - PASSED  
-\>Si5351C test  
CLK0: 17554 / 17554 - PASSED  
CLK1: 17554 / 17554 - PASSED  
CLK2: 17554 / 17554 - PASSED  
CLK3: 17554 / 17554 - PASSED  
CLK4: 17554 / 17554 - PASSED  
CLK5: 17554 / 17554 - PASSED  
CLK6: 17554 / 17554 - PASSED  
-\>ADF4002 Test  
Result: 10 - PASSED  
-\>VCTCXO test  
Results : 5112941 (min); 5113080 (max) - PASSED  
-\>Clock Network Test PASSED

[FPGA EEPROM Test]  
-\>Read EEPROM  
-\>Read data: 13 01 18 13 01 18 02  
-\>FPGA EEPROM Test PASSED

[LMS7002M Test]  
-\>Perform Registers Test  
-\>External Reset line test  
Reg 0x20: Write value 0xFFFD, Read value 0xFFFD  
Reg 0x20: value after reset 0x0FFFF  
-\>LMS7002M Test PASSED

[RF Loopback Test]  
Note: The test should be run without anything connected to RF ports  
-\>Configure LMS  
-\>Run Tests (TX\_2-\> LNA\_L):  
CH0 (SXR=800.0MHz, SXT=805.0MHz): Result:(-15.1 dBFS, 5.00 MHz) - PASSED  
CH1 (SXR=800.0MHz, SXT=805.0MHz): Result:(-17.4 dBFS, 5.00 MHz) - PASSED  
-\>Run Tests (TX\_1 → LNA\_W):  
CH0 (SXR=1800.0MHz, SXT=1805.0MHz): Result:(-43.3 dBFS, -20.00 MHz) - FAILED  
CH1 (SXR=1800.0MHz, SXT=1805.0MHz): Result:(-20.0 dBFS, 5.00 MHz) - PASSED  
-\>Run Tests (TX\_2-\> LNA\_H):  
CH0 (SXR=2500.0MHz, SXT=2505.0MHz): Result:(-17.8 dBFS, 5.00 MHz) - PASSED  
CH1 (SXR=2500.0MHz, SXT=2505.0MHz): Result:(-15.6 dBFS, 5.00 MHz) - PASSED  
-\>RF Loopback Test FAILED

=\> Board tests FAILED \<=

Elapsed time: 6.49 seconds

Can you provide CroudSupply contact link so I can request replacement?

Regards,  
Rohit Soni

---

<div class="post-metadata">

### Author: ![andrewback](https://avatars.discourse-cdn.com/v4/letter/a/22d042/32.png) [@andrewback](https://discourse.myriadrf.org/u/andrewback)
#### Post date: [17 December 2020 11:26 UTC](https://discourse.myriadrf.org/t/cs-lime-01-board-test-failure/6776/5 "2020-12-17T11:26:55Z")

</div>

> [@rohit.soni](#):
>
> Did update on the same board. The firmware still did not updated and the LimeUtil --update command says no need to update and stays on 22 version.

Can you please post details of the error as the firmware update fails.

---

<div class="post-metadata">

### Author: ![rohit.soni](https://avatars.discourse-cdn.com/v4/letter/r/bc79bd/32.png) [@rohit.soni](https://discourse.myriadrf.org/u/rohit.soni)
#### Post date: [17 December 2020 11:44 UTC](https://discourse.myriadrf.org/t/cs-lime-01-board-test-failure/6776/6 "2020-12-17T11:44:29Z")

</div>

Here is the attached image. it says no firmware update required

 ![Screenshot from 2020-12-17 17-05-16](https://canada1.discourse-cdn.com/flex034/uploads/myriadrf/original/2X/5/57d5f15cf0121592b2dd75e10d37953b7f5b4d60.jpeg)

---

<div class="post-metadata">

### Author: ![rohit.soni](https://avatars.discourse-cdn.com/v4/letter/r/bc79bd/32.png) [@rohit.soni](https://discourse.myriadrf.org/u/rohit.soni)
#### Post date: [25 December 2020 15:17 UTC](https://discourse.myriadrf.org/t/cs-lime-01-board-test-failure/6776/7 "2020-12-25T15:17:59Z")

</div>

Hello @andrewback , Any update on error message?

---

<div class="post-metadata">

### Author: ![mzs](https://yyz2.discourse-cdn.com/flex034/user_avatar/discourse.myriadrf.org/mzs/32/2678_2.png) [@mzs](https://discourse.myriadrf.org/u/mzs)
#### Post date: [25 December 2020 16:20 UTC](https://discourse.myriadrf.org/t/cs-lime-01-board-test-failure/6776/8 "2020-12-25T16:20:48Z")

</div>

Old software then ?  
The [current gateware](https://downloads.myriadrf.org/project/limesuite/20.10/) for LimeSDR-USB hardware revision 1.4, since 2020-05-21 is version 2, revision 23 which was officially released 2020-10-29 ( ref: [https://github.com/myriadrf/LimeSDR-USB\_GW/blob/master/src/revision/revision.vhd#L17](https://github.com/myriadrf/LimeSDR-USB_GW/blob/master/src/revision/revision.vhd#L17) )
